{"text_format":"1","workbook":"xlsx","n_sheets":17,"sheets":["User Guidance","New materials","MACC draft","Draft table","Input and Dasboard_draft","LCI and calculations","MACC data layers","MACC data materials","MACC assist","Data validation","Assumptions and data for tool","Factors - SimaPro","Incoming assumptions list","Layout_v0.2","Road - Inventory","Sheet2","Sheet1"],"not_rendered":{"charts":12,"images":9,"macros":1,"external_links":1,"defined_names":10,"comments":4,"pivot_tables":0},"unopened":[],"bounds":{"document_bytes":16777216,"sheet_cells":100000,"rows_first":2000,"rows_last":500,"rows_between":2000,"halvings":0,"cell_chars":16384,"cell_head_chars":4096},"cells_cut":0,"cells_raw":0,"read":"whole","date_system":"1900"}

{"sheet":"User Guidance","index":0,"n_rows":10,"n_cols":2,"rows_kept":10,"cut":false,"hidden":false,"merged":[[8,1,8,3],[7,1,7,3],[6,1,6,3],[9,1,9,3]]}
[]
[]
[]
[]
[]
[]
{"$rows_left_out":5}
{"sheet":"New materials","index":1,"n_rows":12,"n_cols":3,"rows_kept":12,"cut":false,"hidden":true,"merged":[]}
[]
["Additional materials"]
["Lime","Wearing-course"]
["Cement","Wearing-course"]
[]
["Plastics","Sub-base","X"]
{"$rows_left_out":7}
{"sheet":"MACC draft","index":2,"n_rows":29,"n_cols":5,"rows_kept":29,"cut":false,"hidden":true,"merged":[[0,0,1,0],[0,1,0,2],[0,3,0,4]]}
["Material/Transport/Utility","Option 1",null,"Option 2"]
[null,"Carbon abated per FU (kg CO2 eq.)","Abatement cost ($/tonne CO2 eq.)","Carbon abated per FU (kg CO2 eq.)","Abatement cost ($/tonne CO2 eq.)"]
["Aggregates-coarse"]
["Aggregates-fine"]
["Bitumen"]
["Cement"]
{"$rows_left_out":24}
{"sheet":"Draft table","index":3,"n_rows":7,"n_cols":5,"rows_kept":7,"cut":false,"hidden":true,"merged":[]}
[]
[null,null,"Baseline","Option 1","Option 2"]
[null,"Carbon footprint",2000,700,1222]
[null,"Project cost",200000,170000,350000]
[null,"Carbon abatement cost",{"$f":"SUM(C6:C7)","v":0}]
[null,"Offset"]
{"$rows_left_out":2}
{"sheet":"Input and Dasboard_draft","index":4,"n_rows":229,"n_cols":40,"rows_kept":229,"cut":false,"hidden":false,"merged":[[99,0,99,4],[80,0,95,0],[65,0,74,0],[0,0,0,4],[156,30,156,39],[96,0,97,0],[96,1,97,1],[15,2,15,3],[54,0,54,4],[15,4,15,5],[156,18,156,28],[42,8,48,8],[66,8,72,8],[81,8,89,8],[17,8,27,8],[31,8,37,8],[55,0,58,0],[15,6,15,7],[14,0,14,7],[17,0,29,0],[42,0,51,0],[31,0,40,0],[151,18,151,19],[146,18,146,19],[147,18,147,19],[148,18,148,19],[149,18,149,19],[150,18,150,19]]}
["General Inputs"]
["Road structure","Unit","Baseline","Option 1","Option 2"]
["Wearing course thickness","mm",50,150,175,null,null,null,null,null,null,null,null,null,null,null,null,null,null,{"$f":"\"Functional Unit (FU) = 1 km of\"&\" \"&$C$7&\"-lane paved road\"","v":"Functional Unit (FU) = 1 km of 2-lane paved road"}]
["Base course thickness ","mm",150,200,0]
["Sub-base course thickness","mm",365,150,200]
["Width of 1 lane ","m",5.0999999999999996,5.0999999999999996,5.0999999999999996]
{"$rows_left_out":224}
{"sheet":"LCI and calculations","index":5,"n_rows":352,"n_cols":79,"rows_kept":352,"cut":false,"hidden":false,"merged":[[59,10,59,19],[79,6,79,20],[82,7,82,8],[80,6,80,20],[82,29,82,30],[82,55,82,56],[17,6,17,20],[17,28,17,41],[17,54,17,67],[20,60,20,67],[37,58,37,67],[59,58,59,67],[79,54,79,68],[80,54,80,68],[20,34,20,41],[37,32,37,41],[59,32,59,41],[79,28,79,42],[80,28,80,42],[20,12,20,19],[37,10,37,19]]}
[]
[]
[]
[]
[]
[]
{"$rows_left_out":347}
{"sheet":"MACC data layers","index":6,"n_rows":19,"n_cols":15,"rows_kept":19,"cut":false,"hidden":true,"merged":[[2,1,2,3],[2,5,2,7],[2,0,3,0],[2,4,3,4]]}
[]
[]
["Layer","Option 1",null,null,"Layer","Option 2",null,null,null,null,null,null,{"$f":"F4","v":"Carbon abated \n(t CO₂ eq.)"},{"$f":"H4","v":"Abatement cost \n($/tonne CO₂ eq.)"}]
[null,"Carbon abated \n(t CO2 eq.)","Total abatement \ncost ($)","Abatement cost \n($/tonne CO2 eq.)",null,"Carbon abated \n(t CO₂ eq.)","Total abatement \ncost ($)","Abatement cost \n($/tonne CO₂ eq.)",null,null,null,{"$f":"A9","v":"Option 1 Total"},{"$f":"IF(B9>0, B9, 0)","v":0},{"$f":"D9","v":1247.762917712349}]
["Wearing course",{"$f":"VLOOKUP(A5,$A$16:$D$18, 2, FALSE)-VLOOKUP(A5, $A$16:$D$18, 3, FALSE)","v":-334.65224902839304},{"$f":"IF('MACC assist'!H7=\"See Table - Materials\", \"N/A\", (F16-E16))","v":-417566.66666666651},{"$f":"IF(C5=\"N/A\", \"N/A\", IFERROR(C5/B5, 0))","v":1247.7629177123465},"Wearing course",{"$f":"VLOOKUP(E5,$A$16:$D$18, 2, FALSE)-VLOOKUP(E5, $A$16:$D$18, 4, FALSE)","v":-379.44516240851601},{"$f":"IF('MACC assist'!H7=\"See Table - Materials\", \"N/A\", (G16-E16))","v":-428042.85714285704},{"$f":"IF(G5=\"N/A\", \"N/A\", IFERROR(G5/F5, 0))","v":1128.0756735067296},null,null,null,{"$f":"E9","v":"Option 2 Total"},{"$f":"IF(F9>0, F9, 0)","v":0},{"$f":"H9","v":631.16055419811028}]
["Base course",{"$f":"VLOOKUP(A6,$A$16:$D$18, 2, FALSE)-VLOOKUP(A6, $A$16:$D$18, 3, FALSE)","v":5.7396652849262182},{"$f":"IF('MACC assist'!H8=\"See Table - Materials\", \"N/A\", (F17-E17))","v":1.4551915228366852E-11},{"$f":"IF(C6=\"N/A\", \"N/A\", IFERROR(C6/B6, 0))","v":2.5353247107603617E-12},"Base course",{"$f":"VLOOKUP(E6,$A$16:$D$18, 2, FALSE)-VLOOKUP(E6, $A$16:$D$18, 4, FALSE)","v":201.24161273083129},{"$f":"IF('MACC assist'!H8=\"See Table - Materials\", \"N/A\", (G17-E17))","v":-99999.999999999985},{"$f":"IF(G6=\"N/A\", \"N/A\", IFERROR(G6/F6, 0))","v":-496.91511930861924}]
{"$rows_left_out":14}
{"sheet":"MACC data materials","index":7,"n_rows":122,"n_cols":41,"rows_kept":122,"cut":false,"hidden":true,"merged":[[0,0,1,0],[0,1,0,2],[0,3,1,3],[0,4,0,5],[69,1,69,3],[69,4,69,6],[69,0,70,0],[23,0,24,0],[46,0,47,0],[23,1,23,2],[46,1,46,2],[46,3,47,3],[23,3,24,3],[46,4,46,5],[23,4,23,5]]}
["Material/Transport/Utility","Option 1",null,"Material/Transport/Utility","Option 2"]
[null,"Carbon abated \n(t CO2 eq.)","Abatement cost \n($/tonne CO2 eq.)",null,"Carbon abated \n(t CO₂ eq.)","Abatement cost \n($/tonne CO₂ eq.)","Option 1 Project Cost","Option 2 Project Cost",null,"Option 1",null,null,"Option 1"]
[{"$f":"_xlfn._xlws.FILTER($A$26:$C$44, (B26:B44>K5)*(C26:C44>K9)*(C26:C44<K13), \"No results\")","v":{"$error":"#NAME?"}},null,null,{"$f":"_xlfn._xlws.FILTER($D$26:$F$44, (E26:E44>K18)*(F26:F44>K22)*(F26:F44<K26),\"No results\")","v":"No results"},null,null,{"$f":"IFERROR(VLOOKUP(A3, $A$72:$D$90, 3, FALSE), 0)","v":0},{"$f":"IFERROR(VLOOKUP(D3, $A$72:$G$90, 6, FALSE), 0)","v":0},null,"Max t CO2",{"$f":"MAX(B72:B90)","v":21.524634553593607},null,null,null,null,"N","O","P","Q","R","S","T","U","V","W","X","Y","Z","AA","AB","AC","AD","AE","AF","AG"]
[null,null,null,null,null,null,0,0,null,"Cutoff",1E-3,null,"t CO2 eq.\nscale","t CO2 eq.\nscale","St line data","t CO2 eq.",{"$f":"TRANSPOSE(A3:A21)","v":{"$error":"#NAME?"}},0,0,0,0,0,0,0,0,0,0,0,0,0,0,0,0,0,0,null,"Columns",{"$f":"COUNTIF(Q4:AH4, \"*\")","v":0},null,{"$f":"_xlfn.UNIQUE(P4:INDIRECT(AL6&AL5))","v":{"$error":"#NAME?"}},{"$error":"#NAME?"}]
[null,null,null,null,null,null,0,0,null,"Cutoff value",{"$f":"K3*K4","v":2.1524634553593609E-2},null,0,{"$f":"ROUND(M5,0)","v":0},-3,0,{"$f":"IFERROR(VLOOKUP(Q4, $A$3:$C$21, 3, FALSE), 0)","v":0},0,0,0,0,0,0,0,0,0,0,0,0,0,0,0,0,0,0,null,"Rows",{"$f":"3+AL4*3","v":3},null,{"$error":"#NAME?"},{"$error":"#NAME?"}]
[null,null,null,null,null,null,0,0,null,null,null,null,{"$f":"(M12-M5)/7","v":{"$error":"#NAME?"}},{"$f":"ROUND(M6,0)","v":{"$error":"#NAME?"}},-3,{"$f":"IF(Q4>0, VLOOKUP(Q4, $A$3:$C$21, 2, FALSE), 0)","v":{"$error":"#NAME?"}},{"$f":"IFERROR(VLOOKUP(Q4, $A$3:$C$21, 3, FALSE), 0)","v":0},0,0,0,0,0,0,0,0,0,0,0,0,0,0,0,0,0,0,null,"Last Column",{"$f":"OFFSET($P$3, 0, AL4)","v":"N"}]
{"$rows_left_out":117}
{"sheet":"MACC assist","index":8,"n_rows":44,"n_cols":20,"rows_kept":44,"cut":false,"hidden":true,"merged":[[29,0,31,0],[35,0,37,0],[41,0,43,0],[41,1,41,2],[41,3,41,4],[41,5,41,6],[35,1,35,2],[35,3,35,4],[35,5,35,6],[29,1,29,2],[29,3,29,4],[29,5,29,6]]}
[]
["Yes","Grid"]
["No","Renewable"]
[]
["Table: Materials",null,null,null,null,null,"Table: Layers"]
["Item","Baseline","Option 1","Option 2",null,null,"Item","Baseline","Option 1","Option 2",null,null,null,0,"Carbon abated \n(t CO₂ eq.)","Abatement cost \n($/tonne CO₂ eq.)"]
{"$rows_left_out":39}
{"sheet":"Data validation","index":9,"n_rows":43,"n_cols":1,"rows_kept":43,"cut":false,"hidden":true,"merged":[]}
[]
[]
["Wearing course"]
["Aggregates-coarse"]
["Aggregates-fine"]
["Bitumen"]
{"$rows_left_out":38}
{"sheet":"Assumptions and data for tool","index":10,"n_rows":36,"n_cols":6,"rows_kept":36,"cut":false,"hidden":false,"merged":[[10,3,13,3],[18,3,25,3]]}
["Asphalt manufacturing "]
["Input","Baseline","Option 1","Option 2","Unit","Source"]
["Electricity",2.7040000000000002,2.7040000000000002,2.7040000000000002,"kWh/t","Reconophalt EPD 2020"]
["Gas",250,250,250,"MJ/t"]
["Diesel",0,0,0,"L/t"]
["Water",0,0,0,"L/t"]
{"$rows_left_out":31}
{"sheet":"Factors - SimaPro","index":11,"n_rows":134,"n_cols":45,"rows_kept":134,"cut":false,"hidden":true,"merged":[]}
[]
["ref  SimaPro <?xml version=\"1.0\" encoding=\"UTF-8\"?><!--35DEC3E7-B29D-4EA4-9836-85F7C3BEBF0E--><SimaPro majorVersion=\"1\" minorVersion=\"0\" command=\"ExpandItemDescriptor\">  <itemDescriptor description=\"Impact assessment table of characterized results with Comparing processes\" id=\"{CD0D9990-0819-4606-A303-E5B52F7426C2}\" type=\"Calc\" calcCommand=\"Compare\" calcResultType=\"Grid\" groupType=\"ImpactAssessment\">    <database server=\"local server\" location=\"C:\\Users\\Public\\Documents\\SimaPro\\Database\" name=\"Professional_20120123\"/>    <products>      <product amount=\"1\" unit=\"t\" product=\"Bitumen\" processType=\"Material\" projectName=\"Reconophalt EPD_Shadow database_copy for LMCC\"/>      <product amount=\"1\" unit=\"t\" product=\"Cement\" processType=\"Material\" projectName=\"Reconophalt EPD_Shadow database_copy for LMCC\"/>      <product amount=\"1\" unit=\"l\" product=\"CRS 60 Tack Coat_LMCC\" processType=\"Material\" projectName=\"Reconophalt EPD_Shadow database_copy for LMCC\"/>      <product amount=\"1\" unit=\"l\" product=\"Diesel use_LMCC\" processType=\"Material\" projectName=\"Reconophalt EPD_Shadow database_copy for LMCC\"/>      <product amount=\"1\" unit=\"kWh\" product=\"Electricity_LMCC\" processType=\"Material\" projectName=\"Reconophalt EPD_Shadow database_copy for LMCC\"/>      <product amount=\"1\" unit=\"t\" product=\"Fly ash\" processType=\"Material\" projectName=\"Reconophalt EPD_Shadow database_copy for LMCC\"/>      <product amount=\"1\" unit=\"MJ\" product=\"Gas_LMCC\" processType=\"Material\" projectName=\"Reconophalt EPD_Shadow database_copy for LMCC\"/>      <product amount=\"1\" unit=\"t\" product=\"Gravel - coarse_LMCC\" processType=\"Material\" projectName=\"Reconophalt EPD_Shadow database_copy for LMCC\"/>      <product amount=\"1\" unit=\"t\" product=\"Incineration - toner product\" processType=\"Material\" projectName=\"Reconophalt EPD_Shadow database_copy for LMCC\"/>      <product amount=\"1\" unit=\"t\" product=\"Landfill - concrete\" processType=\"Material\" projectName=\"Reconophalt EPD_Shadow database_copy for LMCC\"/>      <product amount=\"1\" unit=\"t\" product=\"Landfill - Flyash\" processType=\"Material\" projectName=\"Reconophalt EPD_Shadow database_copy for LMCC\"/>      <product amount=\"1\" unit=\"t\" product=\"Landfill - glass\" processType=\"Material\" projectName=\"Reconophalt EPD_Shadow database_copy for LMCC\"/>      <product amount=\"1\" unit=\"t\" product=\"Landfill - plastics\" processType=\"Material\" projectName=\"Reconophalt EPD_Shadow database_copy for LMCC\"/>      <product amount=\"1\" unit=\"t\" product=\"Landfill - toner product\" processType=\"Material\" projectName=\"Reconophalt EPD_Shadow database_copy for LMCC\"/>      <product amount=\"1\" unit=\"t\" product=\"Lime_LMCC\" processType=\"Material\" projectName=\"Reconophalt EPD_Shadow database_copy for LMCC\"/>      <product amount=\"1\" unit=\"l\" product=\"Pavertrend (Slip Release)_LMCC\" processType=\"Material\" projectName=\"Reconophalt EPD_Shadow database_copy for LMCC\"/>      <product amount=\"1\" unit=\"t\" product=\"Plant emissions - default_LMCC\" processType=\"Material\" projectName=\"Reconophalt EPD_Shadow database_copy for LMCC\"/>      <product amount=\"1\" unit=\"t\" product=\"RAP_LMCC\" processType=\"Material\" projectName=\"Reconophalt EPD_Shadow database_copy for LMCC\"/>      <product amount=\"1\" unit=\"t\" product=\"Sand_LMCC\" processType=\"Material\" projectName=\"Reconophalt EPD_Shadow database_copy for LMCC\"/>      <product amount=\"1\" unit=\"t\" product=\"Stabilised Gravel_LMCC\" processType=\"Material\" projectName=\"Reconophalt EPD_Shadow database_copy for LMCC\"/>      <product amount=\"1\" unit=\"tkm\" product=\"Truck transport\" processType=\"Material\" projectName=\"Reconophalt EPD_Shadow database_copy for LMCC\"/>      <product amount=\"1\" unit=\"t\" product=\"Waste concrete_LMCC\" processType=\"Material\" projectName=\"Reconophalt EPD_Shadow database_copy for LMCC\"/>      <product amount=\"1\" unit=\"t\" product=\"Waste concrete_renewable_LMCC\" processType=\"Material\" projectName=\"Reconophalt EPD_Shadow database_copy for LMCC\"/>      <product amount=\"1\" unit=\"t\" product=\"Waste Glass - renewable_LMCC\" processType=\"Material\" projectName=\"Reconophalt EPD_Shadow database_copy for LMCC\"/>      <product amount=\"1\" unit=\"t\" product=\"Waste Glass_LMCC\" processType=\"Material\" projectName=\"Reconophalt EPD_Shadow database_copy for LMCC\"/>      <product amount=\"1\" unit=\"t\" product=\"Waste plastics_LMCC\" processType=\"Material\" projectName=\"Reconophalt EPD_Shadow database_copy for LMCC\"/>      <product amount=\"1\" unit=\"t\" product=\"Waste plastics_renewable_LMCC\" processType=\"Material\" projectName=\"Reconophalt EPD_Shadow database_copy for LMCC\"/>      <product amount=\"1\" unit=\"t\" product=\"Waste toner product_LMCC\" processType=\"Material\" projectName=\"Reconophalt EPD_Shadow database_copy for LMCC\"/>      <product amount=\"1\" unit=\"t\" product=\"Waste toner product_renewable_LMCC\" processType=\"Material\" projectName=\"Reconophalt EPD_Shadow database_copy for LMCC\"/>      <product amount=\"1\" unit=\"t\" product=\"Waste tyre_LMCC\" processType=\"Material\" projectName=\"Reconophalt EPD_Shadow database_copy for LMCC\"/>      <product amount=\"1\" unit=\"t\" product=\"Waste tyre_renewable_LMCC\" processType=\"Material\" projectName=\"Reconophalt EPD_Shadow database_copy for LMCC\"/>      <product amount=\"1\" unit=\"l\" product=\"Water use_LMCC\" processType=\"Material\" projectName=\"Reconophalt EPD_Shadow database_copy for LMCC\"/>      <product amount=\"1\" unit=\"t\" product=\"Benefits-Fly ash\" processType=\"Material\" projectName=\"Reconophalt EPD_Shadow database_copy for LMCC\"/>      <product amount=\"1\" unit=\"t\" product=\"Benefits-Plastics\" processType=\"Material\" projectName=\"Reconophalt EPD_Shadow database_copy for LMCC\"/>      <product amount=\"1\" unit=\"t\" product=\"Benefits-RAP Aggregates\" processType=\"Material\" projectName=\"Reconophalt EPD_Shadow database_copy for LMCC\"/>      <product amount=\"1\" unit=\"t\" product=\"Benefits-RAP Bitumen\" processType=\"Material\" projectName=\"Reconophalt EPD_Shadow database_copy for LMCC\"/>      <product amount=\"1\" unit=\"t\" product=\"Benefits-Toner product\" processType=\"Material\" projectName=\"Reconophalt EPD_Shadow database_copy for LMCC\"/>      <product amount=\"1\" unit=\"t\" product=\"Benefits-Waste concrete\" processType=\"Material\" projectName=\"Reconophalt EPD_Shadow database_copy for LMCC\"/>      <product amount=\"1\" unit=\"t\" product=\"Benefits-Waste Glass\" processType=\"Material\" projectName=\"Reconophalt EPD_Shadow database_copy for LMCC\"/>      <product amount=\"1\" unit=\"t\" product=\"Benefits-Waste tyre\" processType=\"Material\" projectName=\"Reconophalt EPD_Shadow database_copy for LMCC\"/>      <product amount=\"1\" unit=\"t\" product=\"Fly ash-renewable\" processType=\"Material\" projectName=\"Reconophalt EPD_Shadow database_copy for LMCC\"/>      <product amount=\"1\" unit=\"t\" product=\"Gravel - fine_LMCC\" processType=\"Material\" projectName=\"Reconophalt EPD_Shadow database_copy for LMCC\"/>      <product amount=\"1\" unit=\"t\" product=\"Natural Gravel_LMCC\" processType=\"Material\" projectName=\"Reconophalt EPD_Shadow database_copy for LMCC\"/>    </products>    <method projectName=\"Reconophalt EPD_Shadow database_copy for LMCC\" name=\"ReCiPe 2016 Midpoint (H) amended_LMCC\"/>    <options resultType=\"characterization\" skipCategories=\"Never\" valueRelativeMode=\"None\" analyseMode=\"Standard\" infrastructure=\"false\" excludeLongTerm=\"false\" useAdjustedUnits=\"true\" sortType=\"ObjectName\" sortIndex=\"-1\" sortOrder=\"Ascending\">      <itemSelection>        <item name=\"Global warming\" selected=\"true\"/>        <item name=\"Water consumption\" selected=\"true\"/>        <item name=\"Terrestrial ecotoxicity\" selected=\"true\"/>        <item name=\"Freshwater ecotoxicity\" selected=\"true\"/>        <item name=\"Marine ecotoxicity\" selected=\"true\"/>        <item name=\"Human carcinogenic toxicity\" selected=\"true\"/>        <item name=\"Human non-carcinogenic toxicity\" selected=\"true\"/>      </itemSelection>    </options>  </itemDescriptor></SimaPro>/ref  SimaPro 45:61"]
["Impact category","Unit","Bitumen","Cement","CRS 60 Tack Coat_LMCC","Diesel use_LMCC","Electricity_LMCC","Fly ash","Gas_LMCC","Gravel - coarse_LMCC","Incineration - toner product","Landfill - concrete","Landfill - Flyash","Landfill - glass","Landfill - plastics","Landfill - toner product","Lime_LMCC","Pavertrend (Slip Release)_LMCC","Plant emissions - default_LMCC","RAP_LMCC","Sand_LMCC","Stabilised Gravel_LMCC","Truck transport","Waste concrete_LMCC","Waste concrete_renewable_LMCC","Waste Glass - renewable_LMCC","Waste Glass_LMCC","Waste plastics_LMCC","Waste plastics_renewable_LMCC","Waste toner product_LMCC","Waste toner product_renewable_LMCC","Waste tyre_LMCC","Waste tyre_renewable_LMCC","Water use_LMCC","Benefits-Fly ash","Benefits-Plastics","Benefits-RAP Aggregates","Benefits-RAP Bitumen","Benefits-Toner product","Benefits-Waste concrete","Benefits-Waste Glass","Benefits-Waste tyre","Fly ash-renewable","Gravel - fine_LMCC","Natural Gravel_LMCC"]
["Global warming","kg CO2 eq",557.68685000000005,961.48508000000004,0.42792503999999998,3.5403467000000002,0.69857712000000005,0,6.3073084000000001E-2,6.6679041000000003,2605.3912999999998,20.211203999999999,94.420561000000006,20.211203999999999,20.211203999999999,195.19488000000001,793.25076000000001,2.0098037999999999E-2,0,3.5410235999999999,5.0270235999999997,54.408763,0.18126109000000001,2.3754431999999999,0,1.3090295000000001,4.0274346999999997,87.831008999999995,26.014054000000002,252.23435000000001,0,225.20597000000001,0.88509746,8.0585795999999995E-4,11.713991999999999,4.5864101000000002,11.713991999999999,712.83822999999995,4.5864101000000002,11.713991999999999,11.713991999999999,4.5864101000000002,0,12.915098,6.6679041000000003]
["Water consumption","m3",0.59115689000000005,1.6703825000000001,5.3065144000000002E-3,8.8517191000000005E-3,1.499968E-3,0,3.3206699999999998E-6,1.4088175000000001,23.131478999999999,9.1247707999999997E-2,0.27072501999999998,9.1247706999999997E-2,9.1247706999999997E-2,1.8305648000000001,1.3239240000000001,4.3014340000000002E-5,0,9.6945824999999999E-3,1.4068046999999999,1.4218957999999999,9.5683724999999996E-4,5.0526178E-3,0,2.0030501E-4,5.9824099999999996E-3,0.21515365,8.3667677999999995E-2,0.52697685000000005,0,0.64915694999999995,0.16750055999999999,1.0034088E-3,1.4085325,1.4072663999999999,1.4085325,8.1756582000000009,1.4072663999999999,1.4085325,1.4085325,1.4072663999999999,0,1.4098351,1.4088175000000001]
["Terrestrial ecotoxicity","kg 1,4-DCB",267.02136000000002,1223.9885999999999,0.25477305,2.9828248999999998,0.1123237,0,2.5405241000000002E-3,10.649051999999999,1685.1197999999999,20.937854999999999,33.421885000000003,20.937854999999999,20.937854999999999,280.55959999999999,75.348708999999999,1.272417E-2,2.5563672,2.9836318999999998,8.0288681000000004,71.316027000000005,0.18024641999999999,1.8598059,0,7.4264978999999995E-2,2.2025861,58.065437000000003,9.6670847000000002,197.25394,0,37.489094999999999,1.420706,9.6070306999999997E-4,21.058586999999999,7.5363686999999997,21.058586999999999,424.05261999999999,7.5363686999999997,21.058586999999999,21.058586999999999,7.5363686999999997,0,20.807465000000001,10.649051999999999]
{"$rows_left_out":129}
{"sheet":"Incoming assumptions list","index":12,"n_rows":42,"n_cols":4,"rows_kept":42,"cut":false,"hidden":true,"merged":[]}
[]
[]
[]
[]
[]
[]
{"$rows_left_out":37}
{"sheet":"Layout_v0.2","index":13,"n_rows":26,"n_cols":1,"rows_kept":26,"cut":false,"hidden":true,"merged":[]}
[]
["Wearing course"]
[]
[]
[]
["Wearing course"]
{"$rows_left_out":21}
{"sheet":"Road - Inventory","index":14,"n_rows":79,"n_cols":18,"rows_kept":79,"cut":false,"hidden":true,"merged":[[42,0,43,0],[42,14,43,14],[44,0,45,0],[44,14,45,14],[46,0,47,0],[46,14,47,14]]}
["Flexible pavements",null,null,null,null,null,null,null,null,null,null,null,null,null,"Rigid pavements"]
["Materials Inventory for flexible pavement - per km-lane","Amount","Unit",null,null,null,null,null,null,null,null,null,null,null,"Materials Inventory for rigid pavement - per km-lane","Amount","Unit"]
["Asphalt",{"$f":"B59","v":324},"t",null,null,null,null,null,null,null,null,null,null,null,"Concrete",{"$f":"P54+P55","v":1400},"m3"]
["Concrete",{"$f":"B55","v":674.99999999999989},"m3",null,null,null,null,null,null,null,null,null,null,null,"Reinforcing steel",{"$f":"P60","v":70},"t"]
["Subbase (Aggregates)",{"$f":"B61","v":1800},"t",null,null,null,null,null,null,null,null,null,null,null,"Subbase (Aggregates)",{"$f":"P62","v":1680},"t"]
["Asphalt transport",{"$f":"B3*B64","v":32400},"tkm",null,null,null,null,null,null,null,null,null,null,null,"Concrete transport",{"$f":"(P59+P61)*P65","v":336000},"tkm"]
{"$rows_left_out":74}
{"sheet":"Sheet2","index":15,"n_rows":52,"n_cols":14,"rows_kept":52,"cut":false,"hidden":true,"merged":[]}
["factor list"]
["Asphalt: 0% RAP"]
["Asphalt: 0-20 RAP"]
["Asphalt: 20-40% RAP"]
["Asphalt: 40-60% RAP"]
["Stabilised gravel","Processing, landfill, recycling, incineration"]
{"$rows_left_out":47}
{"sheet":"Sheet1","index":16,"n_rows":21,"n_cols":3,"rows_kept":21,"cut":false,"hidden":true,"merged":[]}
[]
[]
[]
[]
[]
[]
{"$rows_left_out":15}